Reaction Details
TargetBeta-2 adrenergic receptor
LigandBDBM50352110
Substrate/Competitorn/a
Meas. Tech.ChEMBL_766719 (CHEMBL1827497)
Ki 7700±n/a nM
Citation Stephenson, KAWilson, AAHoule, SVasdev, N Synthesis and in vitro evaluation of derivatives of theß¿?-adrenergic receptor antagonist HX-CH 44. Bioorg Med Chem Lett21:5506-9 (2011) 
 
Beta-2 adrenergic receptor
Name:Beta-2 adrenergic receptor
Type:n/a
Mol. Mass.:46461.69
Organism:Homo sapiens (Human)
Description:P07550
Residue:413
BDBM50352110
NameBDBM50352110
Synonyms:CHEMBL1824264
TypeSmall organic molecule
Emp. Form.C22H27N3O4
Mol. Mass.397.4675
SMILESCOc1ccc2nc(-c3ccc(OCC(O)CNC(C)C)cc3)n(C)c(=O)c2c1