Reaction Details
TargetBeta-2 adrenergic receptor
LigandBDBM50352112
Substrate/Competitorn/a
Meas. Tech.ChEMBL_766719 (CHEMBL1827497)
Ki>10000±n/a nM
Citation Stephenson, KAWilson, AAHoule, SVasdev, N Synthesis and in vitro evaluation of derivatives of theß¿?-adrenergic receptor antagonist HX-CH 44. Bioorg Med Chem Lett21:5506-9 (2011) 
 
Beta-2 adrenergic receptor
Name:Beta-2 adrenergic receptor
Type:n/a
Mol. Mass.:46461.69
Organism:Homo sapiens (Human)
Description:P07550
Residue:413
BDBM50352112
NameBDBM50352112
Synonyms:CHEMBL1824266
TypeSmall organic molecule
Emp. Form.C22H26FN3O4
Mol. Mass.415.4579
SMILESCOc1ccc2nc(-c3ccc(OC[C@@H](O)CNC(C)CF)cc3)n(C)c(=O)c2c1