Reaction Details
Target5-hydroxytryptamine receptor 1A
LigandBDBM50352111
Substrate/Competitorn/a
Meas. Tech.ChEMBL_766720 (CHEMBL1827498)
Ki>10000±n/a nM
Citation Stephenson, KAWilson, AAHoule, SVasdev, N Synthesis and in vitro evaluation of derivatives of theß¿?-adrenergic receptor antagonist HX-CH 44. Bioorg Med Chem Lett21:5506-9 (2011) 
 
5-hydroxytryptamine receptor 1A
Name:5-hydroxytryptamine receptor 1A
Type:n/a
Mol. Mass.:46122.49
Organism:Homo sapiens (Human)
Description:n/a
Residue:422
BDBM50352111
NameBDBM50352111
Synonyms:CHEMBL1824265
TypeSmall organic molecule
Emp. Form.C22H26FN3O4
Mol. Mass.415.4579
SMILESCOc1ccc2nc(-c3ccc(OCC(O)CNC(C)CF)cc3)n(C)c(=O)c2c1