Reaction Details
TargetAlpha-2B adrenergic receptor
LigandBDBM50352160
Substrate/Competitorn/a
Meas. Tech.ChEMBL_767223 (CHEMBL1826469)
Ki>10000±n/a nM
Citation Banister, SDYoo, DTChua, SWCui, JMach, RHKassiou, M N-Arylalkyl-2-azaadamantanes as cage-expanded polycarbocyclic sigma (s) receptor ligands. Bioorg Med Chem Lett21:5289-92 (2011) 
 
Alpha-2B adrenergic receptor
Name:Alpha-2B adrenergic receptor
Type:Enzyme
Mol. Mass.:49964.20
Organism:Homo sapiens (Human)
Description:P18089
Residue:450
BDBM50352160
NameBDBM50352160
Synonyms:CHEMBL1824777
TypeSmall organic molecule
Emp. Form.C16H21NO
Mol. Mass.243.344
SMILESOC12CC3CC(CC(C3)N1Cc1ccccc1)C2