Reaction Details
TargetSigma non-opioid intracellular receptor 1
LigandBDBM50352149
Substrate/Competitorn/a
Meas. Tech.ChEMBL_767116 (CHEMBL1826165)
Ki 12±n/a nM
Citation Banister, SDYoo, DTChua, SWCui, JMach, RHKassiou, M N-Arylalkyl-2-azaadamantanes as cage-expanded polycarbocyclic sigma (s) receptor ligands. Bioorg Med Chem Lett21:5289-92 (2011) 
 
Sigma non-opioid intracellular receptor 1
Name:Sigma non-opioid intracellular receptor 1
Type:Protein
Mol. Mass.:25307.17
Organism:Cavia porcellus (Guinea pig)
Description:Q60492
Residue:223
BDBM50352149
NameBDBM50352149
Synonyms:CHEMBL1824788
TypeSmall organic molecule
Emp. Form.C17H23NO
Mol. Mass.257.3706
SMILESCOc1ccc(CN2C3CC4CC(C3)CC2C4)cc1