Reaction Details
TargetAlpha-1A adrenergic receptor
LigandBDBM50352152
Substrate/Competitorn/a
Meas. Tech.ChEMBL_767221 (CHEMBL1826467)
Ki>10000±n/a nM
Citation Banister, SDYoo, DTChua, SWCui, JMach, RHKassiou, M N-Arylalkyl-2-azaadamantanes as cage-expanded polycarbocyclic sigma (s) receptor ligands. Bioorg Med Chem Lett21:5289-92 (2011) 
 
Alpha-1A adrenergic receptor
Name:Alpha-1A adrenergic receptor
Type:Cell-surface receptors
Mol. Mass.:51511.67
Organism:Homo sapiens (Human)
Description:P35348
Residue:466
BDBM50352152
NameBDBM50352152
Synonyms:CHEMBL1824785
TypeSmall organic molecule
Emp. Form.C16H20FN
Mol. Mass.245.3351
SMILESFc1cccc(CN2C3CC4CC(C3)CC2C4)c1