Reaction Details
TargetD(1A) dopamine receptor
LigandBDBM50352152
Substrate/Competitorn/a
Meas. Tech.ChEMBL_767224 (CHEMBL1826470)
Ki>10000±n/a nM
Citation Banister, SDYoo, DTChua, SWCui, JMach, RHKassiou, M N-Arylalkyl-2-azaadamantanes as cage-expanded polycarbocyclic sigma (s) receptor ligands. Bioorg Med Chem Lett21:5289-92 (2011) 
 
D(1A) dopamine receptor
Name:D(1A) dopamine receptor
Type:Enzyme
Mol. Mass.:49303.43
Organism:Homo sapiens (Human)
Description:P21728
Residue:446
BDBM50352152
NameBDBM50352152
Synonyms:CHEMBL1824785
TypeSmall organic molecule
Emp. Form.C16H20FN
Mol. Mass.245.3351
SMILESFc1cccc(CN2C3CC4CC(C3)CC2C4)c1