Reaction Details
TargetMuscarinic acetylcholine receptor M4
LigandBDBM50352153
Substrate/Competitorn/a
Meas. Tech.ChEMBL_767226 (CHEMBL1826472)
Ki 1784±n/a nM
Citation Banister, SDYoo, DTChua, SWCui, JMach, RHKassiou, M N-Arylalkyl-2-azaadamantanes as cage-expanded polycarbocyclic sigma (s) receptor ligands. Bioorg Med Chem Lett21:5289-92 (2011) 
 
Muscarinic acetylcholine receptor M4
Name:Muscarinic acetylcholine receptor M4
Type:Enzyme Catalytic Domain
Mol. Mass.:53079.31
Organism:Homo sapiens (Human)
Description:Cholinergic, muscarinic M4 CHRM4 HUMAN M3::P08173
Residue:479
BDBM50352153
NameBDBM50352153
Synonyms:CHEMBL1824784
TypeSmall organic molecule
Emp. Form.C16H21N
Mol. Mass.227.3446
SMILESC(N1C2CC3CC(C2)CC1C3)c1ccccc1