Reaction Details
TargetMuscarinic acetylcholine receptor M5
LigandBDBM50352152
Substrate/Competitorn/a
Meas. Tech.ChEMBL_767227 (CHEMBL1826473)
Ki 5484±n/a nM
Citation Banister, SDYoo, DTChua, SWCui, JMach, RHKassiou, M N-Arylalkyl-2-azaadamantanes as cage-expanded polycarbocyclic sigma (s) receptor ligands. Bioorg Med Chem Lett21:5289-92 (2011) 
 
Muscarinic acetylcholine receptor M5
Name:Muscarinic acetylcholine receptor M5
Type:PROTEIN
Mol. Mass.:60102.35
Organism:Homo sapiens (Human)
Description:ChEMBL_1517990
Residue:532
BDBM50352152
NameBDBM50352152
Synonyms:CHEMBL1824785
TypeSmall organic molecule
Emp. Form.C16H20FN
Mol. Mass.245.3351
SMILESFc1cccc(CN2C3CC4CC(C3)CC2C4)c1