Reaction Details
TargetKappa-type opioid receptor
LigandBDBM50352160
Substrate/Competitorn/a
Meas. Tech.ChEMBL_767229 (CHEMBL1826475)
Ki 662±n/a nM
Citation Banister, SDYoo, DTChua, SWCui, JMach, RHKassiou, M N-Arylalkyl-2-azaadamantanes as cage-expanded polycarbocyclic sigma (s) receptor ligands. Bioorg Med Chem Lett21:5289-92 (2011) 
 
Kappa-type opioid receptor
Name:Kappa-type opioid receptor
Type:G Protein-Coupled Receptor (GPCR)
Mol. Mass.:42648.76
Organism:Homo sapiens (Human)
Description:P41145
Residue:380
BDBM50352160
NameBDBM50352160
Synonyms:CHEMBL1824777
TypeSmall organic molecule
Emp. Form.C16H21NO
Mol. Mass.243.344
SMILESOC12CC3CC(CC(C3)N1Cc1ccccc1)C2