Reaction Details
TargetPotassium voltage-gated channel subfamily H member 2
LigandBDBM50224189
Substrate/Competitorn/a
Meas. Tech.ChEMBL_766668 (CHEMBL1827362)
IC50 10400±n/a nM
Citation Levoin, NLabeeuw, OCalmels, TPoupardin-Olivier, OBerrebi-Bertrand, ILecomte, JMSchwartz, JCCapet, M Novel and highly potent histamine H3 receptor ligands. Part 1: withdrawing of hERG activity. Bioorg Med Chem Lett21:5378-83 (2011) 
 
Potassium voltage-gated channel subfamily H member 2
Name:Potassium voltage-gated channel subfamily H member 2
Type:Multi-pass membrane protein
Mol. Mass.:126672.65
Organism:Homo sapiens (Human)
Description:Q12809
Residue:1159
BDBM50224189
NameBDBM50224189
Synonyms:(R)-2-(4-methyl-2-(pyrrolidin-1-yl)pyrimidin-5-yl)-6-(2-(2-methylpyrrolidin-1-yl)ethyl)quinoline CHEMBL237191
TypeSmall organic molecule
Emp. Form.C25H31N5
Mol. Mass.401.5471
SMILESC[C@@H]1CCCN1CCc1ccc2nc(ccc2c1)-c1cnc(nc1C)N1CCCC1