Reaction Details
TargetPotassium voltage-gated channel subfamily H member 2
LigandBDBM50352335
Substrate/Competitorn/a
Meas. Tech.ChEMBL_766668 (CHEMBL1827362)
Ki 8±n/a nM
Citation Levoin, NLabeeuw, OCalmels, TPoupardin-Olivier, OBerrebi-Bertrand, ILecomte, JMSchwartz, JCCapet, M Novel and highly potent histamine H3 receptor ligands. Part 1: withdrawing of hERG activity. Bioorg Med Chem Lett21:5378-83 (2011) 
 
Potassium voltage-gated channel subfamily H member 2
Name:Potassium voltage-gated channel subfamily H member 2
Type:Multi-pass membrane protein
Mol. Mass.:126672.65
Organism:Homo sapiens (Human)
Description:Q12809
Residue:1159
BDBM50352335
NameBDBM50352335
Synonyms:CHEMBL1822861
TypeSmall organic molecule
Emp. Form.C23H29NO3
Mol. Mass.367.4813
SMILESCCOC(=O)c1ccc(cc1)-c1ccc(OCCCN2CCCCC2)cc1