Reaction Details
TargetHistamine H3 receptor
LigandBDBM50246243
Substrate/Competitorn/a
Meas. Tech.ChEMBL_766669 (CHEMBL1827363)
Ki 0.15625±n/a nM
Citation Levoin, NLabeeuw, OCalmels, TPoupardin-Olivier, OBerrebi-Bertrand, ILecomte, JMSchwartz, JCCapet, M Novel and highly potent histamine H3 receptor ligands. Part 1: withdrawing of hERG activity. Bioorg Med Chem Lett21:5378-83 (2011) 
 
Histamine H3 receptor
Name:Histamine H3 receptor
Type:G Protein-Coupled Receptor (GPCR)
Mol. Mass.:48691.47
Organism:Homo sapiens (Human)
Description:Binding assays were using CHO cells stably expressing hH3R receptors.
Residue:445
BDBM50246243
NameBDBM50246243
Synonyms:2-(4-(3-(piperidin-1-yl)propoxy)phenyl)-3-propylquinazolin-4(3H)-one | CHEMBL487230
TypeSmall organic molecule
Emp. Form.C25H31N3O2
Mol. Mass.405.5325
SMILESCCCn1c(nc2ccccc2c1=O)-c1ccc(OCCCN2CCCCC2)cc1