Reaction Details
TargetHistamine H3 receptor
LigandBDBM50262883
Substrate/Competitorn/a
Meas. Tech.ChEMBL_766669 (CHEMBL1827363)
Ki 1.2±n/a nM
Citation Levoin, NLabeeuw, OCalmels, TPoupardin-Olivier, OBerrebi-Bertrand, ILecomte, JMSchwartz, JCCapet, M Novel and highly potent histamine H3 receptor ligands. Part 1: withdrawing of hERG activity. Bioorg Med Chem Lett21:5378-83 (2011) 
 
Histamine H3 receptor
Name:Histamine H3 receptor
Type:G Protein-Coupled Receptor (GPCR)
Mol. Mass.:48691.47
Organism:Homo sapiens (Human)
Description:Binding assays were using CHO cells stably expressing hH3R receptors.
Residue:445
BDBM50262883
NameBDBM50262883
Synonyms:8-Methoxy-2-methyl-3-(4-{[3-(1-pyrrolidinyl)propyl]oxy}phenyl)-4(3H)-quinazolinone trifluoroacetate | CHEMBL477152
TypeSmall organic molecule
Emp. Form.C23H27N3O3
Mol. Mass.393.4788
SMILESCOc1cccc2c1nc(C)n(-c1ccc(OCCCN3CCCC3)cc1)c2=O