Reaction Details
TargetHistamine H3 receptor
LigandBDBM50296172
Substrate/Competitorn/a
Meas. Tech.ChEMBL_766669 (CHEMBL1827363)
Ki 0.5±n/a nM
Citation Levoin, NLabeeuw, OCalmels, TPoupardin-Olivier, OBerrebi-Bertrand, ILecomte, JMSchwartz, JCCapet, M Novel and highly potent histamine H3 receptor ligands. Part 1: withdrawing of hERG activity. Bioorg Med Chem Lett21:5378-83 (2011) 
 
Histamine H3 receptor
Name:Histamine H3 receptor
Type:G Protein-Coupled Receptor (GPCR)
Mol. Mass.:48691.47
Organism:Homo sapiens (Human)
Description:Binding assays were using CHO cells stably expressing hH3R receptors.
Residue:445
BDBM50296172
NameBDBM50296172
Synonyms:(+/-)-1-{3-[4-(5-Methoxy-3-methyl-4,4-dioxo-3,4-dihydro-2H-4lambda*6*-benzo[1,4]oxathiin-2-yl)-phenoxy]-propyl}-pyrrolidine | CHEMBL549639
TypeSmall organic molecule
Emp. Form.C23H29NO5S
Mol. Mass.431.545
SMILESCOc1cccc2OC(C(C)S(=O)(=O)c12)c1ccc(OCCCN2CCCC2)cc1