Reaction Details
TargetHistamine H3 receptor
LigandBDBM50246434
Substrate/Competitorn/a
Meas. Tech.ChEMBL_766669 (CHEMBL1827363)
Ki 0.078125±n/a nM
Citation Levoin, NLabeeuw, OCalmels, TPoupardin-Olivier, OBerrebi-Bertrand, ILecomte, JMSchwartz, JCCapet, M Novel and highly potent histamine H3 receptor ligands. Part 1: withdrawing of hERG activity. Bioorg Med Chem Lett21:5378-83 (2011) 
 
Histamine H3 receptor
Name:Histamine H3 receptor
Type:G Protein-Coupled Receptor (GPCR)
Mol. Mass.:48691.47
Organism:Homo sapiens (Human)
Description:Binding assays were using CHO cells stably expressing hH3R receptors.
Residue:445
BDBM50246434
NameBDBM50246434
Synonyms:2-(4-(1-cyclobutylpiperidin-4-yloxy)phenyl)-8-fluoro-3-methylquinazolin-4(3H)-one | CHEMBL454642
TypeSmall organic molecule
Emp. Form.C24H26FN3O2
Mol. Mass.407.4805
SMILESCn1c(nc2c(F)cccc2c1=O)-c1ccc(OC2CCN(CC2)C2CCC2)cc1