Reaction Details
TargetHistamine H3 receptor
LigandBDBM50297367
Substrate/Competitorn/a
Meas. Tech.ChEMBL_766669 (CHEMBL1827363)
Ki 1.584893192±n/a nM
Citation Levoin, NLabeeuw, OCalmels, TPoupardin-Olivier, OBerrebi-Bertrand, ILecomte, JMSchwartz, JCCapet, M Novel and highly potent histamine H3 receptor ligands. Part 1: withdrawing of hERG activity. Bioorg Med Chem Lett21:5378-83 (2011) 
 
Histamine H3 receptor
Name:Histamine H3 receptor
Type:G Protein-Coupled Receptor (GPCR)
Mol. Mass.:48691.47
Organism:Homo sapiens (Human)
Description:Binding assays were using CHO cells stably expressing hH3R receptors.
Residue:445
BDBM50297367
NameBDBM50297367
Synonyms:4'-[2-((R)-2-Methyl-pyrrolidin-1-yl)-ethyl]-biphenyl-4-sulfonic Acid(Tetrahydro-pyran-4-yl)-amide | CHEMBL559118
TypeSmall organic molecule
Emp. Form.C24H32N2O3S
Mol. Mass.428.587
SMILESC[C@@H]1CCCN1CCc1ccc(cc1)-c1ccc(cc1)S(=O)(=O)NC1CCOCC1