Reaction Details
TargetHistamine H3 receptor
LigandBDBM50319547
Substrate/Competitorn/a
Meas. Tech.ChEMBL_766669 (CHEMBL1827363)
Ki 0.16±n/a nM
Citation Levoin, NLabeeuw, OCalmels, TPoupardin-Olivier, OBerrebi-Bertrand, ILecomte, JMSchwartz, JCCapet, M Novel and highly potent histamine H3 receptor ligands. Part 1: withdrawing of hERG activity. Bioorg Med Chem Lett21:5378-83 (2011) 
 
Histamine H3 receptor
Name:Histamine H3 receptor
Type:G Protein-Coupled Receptor (GPCR)
Mol. Mass.:48691.47
Organism:Homo sapiens (Human)
Description:Binding assays were using CHO cells stably expressing hH3R receptors.
Residue:445
BDBM50319547
NameBDBM50319547
Synonyms:(R)-3-(4-chlorophenyl)-5-methyl-4-(6-(2-(2-methylpyrrolidin-1-yl)ethyl)quinolin-2-yl)isoxazole | CHEMBL1085396
TypeSmall organic molecule
Emp. Form.C26H26ClN3O
Mol. Mass.431.957
SMILESC[C@@H]1CCCN1CCc1ccc2nc(ccc2c1)-c1c(C)onc1-c1ccc(Cl)cc1