Reaction Details
TargetHistamine H3 receptor
LigandBDBM50319534
Substrate/Competitorn/a
Meas. Tech.ChEMBL_766669 (CHEMBL1827363)
Ki 0.2±n/a nM
Citation Levoin, NLabeeuw, OCalmels, TPoupardin-Olivier, OBerrebi-Bertrand, ILecomte, JMSchwartz, JCCapet, M Novel and highly potent histamine H3 receptor ligands. Part 1: withdrawing of hERG activity. Bioorg Med Chem Lett21:5378-83 (2011) 
 
Histamine H3 receptor
Name:Histamine H3 receptor
Type:G Protein-Coupled Receptor (GPCR)
Mol. Mass.:48691.47
Organism:Homo sapiens (Human)
Description:Binding assays were using CHO cells stably expressing hH3R receptors.
Residue:445
BDBM50319534
NameBDBM50319534
Synonyms:(R)-2-(2-methoxypyrimidin-5-yl)-6-(2-(2-methylpyrrolidin-1-yl)ethyl)quinoline | CHEMBL1082489
TypeSmall organic molecule
Emp. Form.C21H24N4O
Mol. Mass.348.4415
SMILESCOc1ncc(cn1)-c1ccc2cc(CCN3CCC[C@H]3C)ccc2n1