Reaction Details
TargetMitogen-activated protein kinase 14
LigandBDBM50352565
Substrate/Competitorn/a
Meas. Tech.ChEMBL_767362 (CHEMBL1825474)
IC50 0.08±n/a nM
Citation Eastwood, PGonzález, JGómez, ECaturla, FBalagué, COrellana, ADomínguez, M Indolin-2-one p38a inhibitors II: Lead optimisation. Bioorg Med Chem Lett21:5270-3 (2011) 
 
Mitogen-activated protein kinase 14
Name:Mitogen-activated protein kinase 14
Type:Serine/threonine-protein kinase
Mol. Mass.:41286.76
Organism:Homo sapiens (Human)
Description:Q16539
Residue:360
BDBM50352565
NameBDBM50352565
Synonyms:CHEMBL1825149
TypeSmall organic molecule
Emp. Form.C23H24N2O2S
Mol. Mass.392.514
SMILESCc1ccc(cc1-c1ccc2c(NC(=O)C22CCSCC2)c1)C(=O)NC1CC1