Reaction Details
TargetMitogen-activated protein kinase 14
LigandBDBM50352569
Substrate/Competitorn/a
Meas. Tech.ChEMBL_767362 (CHEMBL1825474)
IC50 1±n/a nM
Citation Eastwood, PGonzález, JGómez, ECaturla, FBalagué, COrellana, ADomínguez, M Indolin-2-one p38a inhibitors II: Lead optimisation. Bioorg Med Chem Lett21:5270-3 (2011) 
 
Mitogen-activated protein kinase 14
Name:Mitogen-activated protein kinase 14
Type:Serine/threonine-protein kinase
Mol. Mass.:41286.76
Organism:Homo sapiens (Human)
Description:Q16539
Residue:360
BDBM50352569
NameBDBM50352569
Synonyms:CHEMBL1825146 | US8772288, 31
TypeSmall organic molecule
Emp. Form.C24H26FN3O4S
Mol. Mass.471.544
SMILESCc1c(F)cc(cc1-c1ccc2c(NC(=O)C22CCN(CC2)S(C)(=O)=O)c1)C(=O)NC1CC1