Reaction Details
TargetMitogen-activated protein kinase 14
LigandBDBM50352573
Substrate/Competitorn/a
Meas. Tech.ChEMBL_767362 (CHEMBL1825474)
IC50 1.8±n/a nM
Citation Eastwood, PGonzález, JGómez, ECaturla, FBalagué, COrellana, ADomínguez, M Indolin-2-one p38a inhibitors II: Lead optimisation. Bioorg Med Chem Lett21:5270-3 (2011) 
 
Mitogen-activated protein kinase 14
Name:Mitogen-activated protein kinase 14
Type:Serine/threonine-protein kinase
Mol. Mass.:41286.76
Organism:Homo sapiens (Human)
Description:Q16539
Residue:360
BDBM50352573
NameBDBM50352573
Synonyms:CHEMBL1825158
TypeSmall organic molecule
Emp. Form.C22H23N3O2
Mol. Mass.361.4369
SMILESCc1ccc(cc1-c1cnc2c(NC(=O)C22CCCC2)c1)C(=O)NC1CC1