Reaction Details
TargetMitogen-activated protein kinase 14
LigandBDBM50352575
Substrate/Competitorn/a
Meas. Tech.ChEMBL_767362 (CHEMBL1825474)
IC50 2.3±n/a nM
Citation Eastwood, PGonzález, JGómez, ECaturla, FBalagué, COrellana, ADomínguez, M Indolin-2-one p38a inhibitors II: Lead optimisation. Bioorg Med Chem Lett21:5270-3 (2011) 
 
Mitogen-activated protein kinase 14
Name:Mitogen-activated protein kinase 14
Type:Serine/threonine-protein kinase
Mol. Mass.:41286.76
Organism:Homo sapiens (Human)
Description:Q16539
Residue:360
BDBM50352575
NameBDBM50352575
Synonyms:CHEMBL1825160
TypeSmall organic molecule
Emp. Form.C23H23F2N3O2
Mol. Mass.411.4444
SMILESCc1ccc(cc1-c1cnc2c(NC(=O)C22CCC(F)(F)CC2)c1)C(=O)NC1CC1