Reaction Details
TargetNitric oxide synthase, brain
LigandBDBM50352592
Substrate/Competitorn/a
Meas. Tech.ChEMBL_767473 (CHEMBL1825585)
IC50 60±n/a nM
Citation Renton, PSpeed, JMaddaford, SAnnedi, SCRamnauth, JRakhit, SAndrews, J 1,5-Disubstituted indole derivatives as selective human neuronal nitric oxide synthase inhibitors. Bioorg Med Chem Lett21:5301-4 (2011) 
 
Nitric oxide synthase, brain
Name:Nitric oxide synthase, brain
Type:Homodimer
Mol. Mass.:160985.98
Organism:Homo sapiens (Human)
Description:P29475
Residue:1434
BDBM50352592
NameBDBM50352592
Synonyms:CHEMBL1825173
TypeSmall organic molecule
Emp. Form.C20H24N4S
Mol. Mass.352.496
SMILESCN1CCC[C@@H]1CCn1ccc2cc(ccc12)N=C(N)c1cccs1