Reaction Details
TargetMitogen-activated protein kinase 8
LigandBDBM50352633
Substrate/Competitorn/a
Meas. Tech.ChEMBL_767684 (CHEMBL1825796)
IC50 14000±n/a nM
Citation Stebbins, JLDe, SKPavlickova, PChen, VMachleidt, TChen, LHKuntzen, CKitada, SKarin, MPellecchia, M Design and characterization of a potent and selective dual ATP- and substrate-competitive subnanomolar bidentate c-Jun N-terminal kinase (JNK) inhibitor. J Med Chem54:6206-14 (2011) 
 
Mitogen-activated protein kinase 8
Name:Mitogen-activated protein kinase 8
Type:Enzyme
Mol. Mass.:48297.57
Organism:Homo sapiens (Human)
Description:JNK-1 was purchased from Upstate Cell Signaling Solutions (formerly Upstate Biotechnology).
Residue:427
BDBM50352633
NameBDBM50352633
Synonyms:CHEMBL1822311
TypeSmall organic molecule
Emp. Form.C17H18N4O
Mol. Mass.294.351
SMILESNCCCNC(=O)c1ccc(cc1)-c1n[nH]c2ccccc12