Reaction Details
TargetNeuronal acetylcholine receptor subunit alpha-7
LigandBDBM50352787
Substrate/Competitorn/a
Meas. Tech.ChEMBL_767063 (CHEMBL1828494)
IC50>10000±n/a nM
Citation Simoni, DRondanin, RMarchetti, PRullo, CBaruchello, RGrisolia, GBarbato, GGiovannini, RMarchioro, CCapelli, AMVirginio, CBozzoli, ABorea, PAMerighi, SDonati, D Synthesis and biological activity of a novel class nicotinic acetylcholine receptors (nAChRs) ligands structurally related to anatoxin-a. Bioorg Med Chem Lett21:5423-7 (2011) 
 
Neuronal acetylcholine receptor subunit alpha-7
Name:Neuronal acetylcholine receptor subunit alpha-7
Type:n/a
Mol. Mass.:56448.33
Organism:Homo sapiens (Human)
Description: CHRNA7 (NACHRA7)
Residue:502
BDBM50352787
NameBDBM50352787
Synonyms:CHEMBL1823383
TypeSmall organic molecule
Emp. Form.C14H18N2O3
Mol. Mass.262.3043
SMILESCCOC(=O)c1cc(on1)C1=CCC[C@@H]2CC[C@H]1N2