Reaction Details
TargetBeta-secretase 1
LigandBDBM50352885
Substrate/Competitorn/a
Meas. Tech.ChEMBL_767493 (CHEMBL1825605)
IC50 60±n/a nM
Citation Malamas, MSErdei, JGunawan, IBarnes, KHui, YJohnson, MRobichaud, AZhou, PYan, YSolvibile, WTurner, JFan, KYChopra, RBard, JPangalos, MN New pyrazolyl and thienyl aminohydantoins as potent BACE1 inhibitors: exploring the S2' region. Bioorg Med Chem Lett21:5164-70 (2011) 
 
Beta-secretase 1
Name:Beta-secretase 1
Type:Protein
Mol. Mass.:55755.10
Organism:Homo sapiens (Human)
Description:P56817
Residue:501
BDBM50352885
NameBDBM50352885
Synonyms:CHEMBL1824354
TypeSmall organic molecule
Emp. Form.C19H16N4OS
Mol. Mass.348.422
SMILESCN1C(N)=NC(C1=O)(c1ccsc1)c1cccc(c1)-c1cccnc1