Reaction Details
TargetBeta-secretase 1
LigandBDBM50352875
Substrate/Competitorn/a
Meas. Tech.ChEMBL_767496 (CHEMBL1825608)
EC50 200±n/a nM
Citation Malamas, MSErdei, JGunawan, IBarnes, KHui, YJohnson, MRobichaud, AZhou, PYan, YSolvibile, WTurner, JFan, KYChopra, RBard, JPangalos, MN New pyrazolyl and thienyl aminohydantoins as potent BACE1 inhibitors: exploring the S2' region. Bioorg Med Chem Lett21:5164-70 (2011) 
 
Beta-secretase 1
Name:Beta-secretase 1
Type:Protein
Mol. Mass.:55755.10
Organism:Homo sapiens (Human)
Description:P56817
Residue:501
BDBM50352875
NameBDBM50352875
Synonyms:CHEMBL1824344
TypeSmall organic molecule
Emp. Form.C22H23FN6O
Mol. Mass.406.456
SMILESCCCCn1cc(cn1)C1(N=C(N)N(C)C1=O)c1cccc(c1)-c1cccnc1F