Reaction Details
TargetBeta-secretase 1
LigandBDBM50352854
Substrate/Competitorn/a
Meas. Tech.ChEMBL_767496 (CHEMBL1825608)
EC50 10±n/a nM
Citation Malamas, MSErdei, JGunawan, IBarnes, KHui, YJohnson, MRobichaud, AZhou, PYan, YSolvibile, WTurner, JFan, KYChopra, RBard, JPangalos, MN New pyrazolyl and thienyl aminohydantoins as potent BACE1 inhibitors: exploring the S2' region. Bioorg Med Chem Lett21:5164-70 (2011) 
 
Beta-secretase 1
Name:Beta-secretase 1
Type:Protein
Mol. Mass.:55755.10
Organism:Homo sapiens (Human)
Description:P56817
Residue:501
BDBM50352854
NameBDBM50352854
Synonyms:CHEMBL1824361
TypeSmall organic molecule
Emp. Form.C22H19FN4O2S
Mol. Mass.422.475
SMILESCCC(=O)c1cc(cs1)[C@@]1(N=C(N)N(C)C1=O)c1cccc(c1)-c1cccnc1F