Reaction Details
TargetBeta-secretase 1
LigandBDBM50352873
Substrate/Competitorn/a
Meas. Tech.ChEMBL_767493 (CHEMBL1825605)
IC50 20±n/a nM
Citation Malamas, MSErdei, JGunawan, IBarnes, KHui, YJohnson, MRobichaud, AZhou, PYan, YSolvibile, WTurner, JFan, KYChopra, RBard, JPangalos, MN New pyrazolyl and thienyl aminohydantoins as potent BACE1 inhibitors: exploring the S2' region. Bioorg Med Chem Lett21:5164-70 (2011) 
 
Beta-secretase 1
Name:Beta-secretase 1
Type:Protein
Mol. Mass.:55755.10
Organism:Homo sapiens (Human)
Description:P56817
Residue:501
BDBM50352873
NameBDBM50352873
Synonyms:CHEMBL1824342
TypeSmall organic molecule
Emp. Form.C24H27FN6O
Mol. Mass.434.5092
SMILESCN1C(N)=NC(C1=O)(c1cnn(CCC(C)(C)C)c1)c1cccc(c1)-c1cccnc1F