Reaction Details
TargetBeta-secretase 2
LigandBDBM50352876
Substrate/Competitorn/a
Meas. Tech.ChEMBL_767494 (CHEMBL1825606)
IC50 120±n/a nM
Citation Malamas, MSErdei, JGunawan, IBarnes, KHui, YJohnson, MRobichaud, AZhou, PYan, YSolvibile, WTurner, JFan, KYChopra, RBard, JPangalos, MN New pyrazolyl and thienyl aminohydantoins as potent BACE1 inhibitors: exploring the S2' region. Bioorg Med Chem Lett21:5164-70 (2011) 
 
Beta-secretase 2
Name:Beta-secretase 2
Type:Protein
Mol. Mass.:56171.20
Organism:Homo sapiens (Human)
Description:Q9Y5Z0
Residue:518
BDBM50352876
NameBDBM50352876
Synonyms:CHEMBL1824345
TypeSmall organic molecule
Emp. Form.C23H23FN6O
Mol. Mass.418.4667
SMILESCN1C(N)=NC(C1=O)(c1cnn(c1)C1CCCC1)c1cccc(c1)-c1cccnc1F