Reaction Details
TargetCannabinoid receptor 1
LigandBDBM50353074
Substrate/Competitorn/a
Meas. Tech.ChEMBL_767976 (CHEMBL1825305)
Ki>10000±n/a nM
Citation Turkman, NShavrin, AIvanov, RARabinovich, BVolgin, AGelovani, JGAlauddin, MM Fluorinated cannabinoid CB2 receptor ligands: synthesis and in vitro binding characteristics of 2-oxoquinoline derivatives. Bioorg Med Chem19:5698-707 (2011) 
 
Cannabinoid receptor 1
Name:Cannabinoid receptor 1
Type:G Protein-Coupled Receptor (GPCR)
Mol. Mass.:52868.96
Organism:Homo sapiens (Human)
Description:P21554
Residue:472
BDBM50353074
NameBDBM50353074
Synonyms:CHEMBL1822928
TypeSmall organic molecule
Emp. Form.C22H23FN2O4
Mol. Mass.398.4274
SMILESCCCCOc1c(OC)ccc2cc(C(=O)NCc3ccc(F)cc3)c(=O)[nH]c12