Reaction Details
TargetCannabinoid receptor 2
LigandBDBM50353083
Substrate/Competitorn/a
Meas. Tech.ChEMBL_767977 (CHEMBL1825306)
Ki 620±n/a nM
Citation Turkman, NShavrin, AIvanov, RARabinovich, BVolgin, AGelovani, JGAlauddin, MM Fluorinated cannabinoid CB2 receptor ligands: synthesis and in vitro binding characteristics of 2-oxoquinoline derivatives. Bioorg Med Chem19:5698-707 (2011) 
 
Cannabinoid receptor 2
Name:Cannabinoid receptor 2
Type:G Protein-Coupled Receptor (GPCR)
Mol. Mass.:39690.94
Organism:Homo sapiens (Human)
Description:P34972
Residue:360
BDBM50353083
NameBDBM50353083
Synonyms:CHEMBL1822937
TypeSmall organic molecule
Emp. Form.C20H24FN5O4
Mol. Mass.417.4341
SMILESCCCCOc1c(OC)ccc2cc(C(=O)NCc3cn(CCF)nn3)c(=O)[nH]c12