Reaction Details
TargetCannabinoid receptor 1
LigandBDBM50353086
Substrate/Competitorn/a
Meas. Tech.ChEMBL_767974 (CHEMBL1825303)
Ki 336000±n/a nM
Citation Turkman, NShavrin, AIvanov, RARabinovich, BVolgin, AGelovani, JGAlauddin, MM Fluorinated cannabinoid CB2 receptor ligands: synthesis and in vitro binding characteristics of 2-oxoquinoline derivatives. Bioorg Med Chem19:5698-707 (2011) 
 
Cannabinoid receptor 1
Name:Cannabinoid receptor 1
Type:G Protein-Coupled Receptor (GPCR)
Mol. Mass.:52868.96
Organism:Homo sapiens (Human)
Description:P21554
Residue:472
BDBM50353086
NameBDBM50353086
Synonyms:CHEMBL1822940
TypeSmall organic molecule
Emp. Form.C22H23FN2O4
Mol. Mass.398.4274
SMILESCCCOc1c(OC)ccc2cc(C(=O)NCCc3ccc(F)cc3)c(=O)[nH]c12