Reaction Details
TargetCannabinoid receptor 2
LigandBDBM50180036
Substrate/Competitorn/a
Meas. Tech.ChEMBL_767975 (CHEMBL1825304)
Ki 3.4±n/a nM
Citation Turkman, NShavrin, AIvanov, RARabinovich, BVolgin, AGelovani, JGAlauddin, MM Fluorinated cannabinoid CB2 receptor ligands: synthesis and in vitro binding characteristics of 2-oxoquinoline derivatives. Bioorg Med Chem19:5698-707 (2011) 
 
Cannabinoid receptor 2
Name:Cannabinoid receptor 2
Type:G Protein-Coupled Receptor (GPCR)
Mol. Mass.:39690.94
Organism:Homo sapiens (Human)
Description:P34972
Residue:360
BDBM50180036
NameBDBM50180036
Synonyms:(6aR,10aR)-3-(1,1-dimethylbutyl)-6a,7,10,10a-tetrahydro-6,6,9-trimethyl-6Hdibenzo[b,d]pyran CHEMBL371214 | JWH-133
TypeSmall organic molecule
Emp. Form.C22H32O
Mol. Mass.312.4889
SMILESCCCC(C)(C)c1ccc2[C@@H]3CC(C)=CC[C@H]3C(C)(C)Oc2c1