Reaction Details
TargetCannabinoid receptor 2
LigandBDBM50353093
Substrate/Competitorn/a
Meas. Tech.ChEMBL_767975 (CHEMBL1825304)
Ki 0.032±n/a nM
Citation Turkman, NShavrin, AIvanov, RARabinovich, BVolgin, AGelovani, JGAlauddin, MM Fluorinated cannabinoid CB2 receptor ligands: synthesis and in vitro binding characteristics of 2-oxoquinoline derivatives. Bioorg Med Chem19:5698-707 (2011) 
 
Cannabinoid receptor 2
Name:Cannabinoid receptor 2
Type:G Protein-Coupled Receptor (GPCR)
Mol. Mass.:39690.94
Organism:Homo sapiens (Human)
Description:P34972
Residue:360
BDBM50353093
NameBDBM50353093
Synonyms:CHEMBL1822946
TypeSmall organic molecule
Emp. Form.C15H17NO5
Mol. Mass.291.2992
SMILESCCCCOc1c(OC)ccc2cc(C(O)=O)c(=O)[nH]c12