Reaction Details
TargetCannabinoid receptor 2
LigandBDBM50353094
Substrate/Competitorn/a
Meas. Tech.ChEMBL_768006 (CHEMBL1825335)
Ki 180±n/a nM
Citation Pollastro, FTaglialatela-Scafati, OAllarà, MMuñoz, EDi Marzo, VDe Petrocellis, LAppendino, G Bioactive prenylogous cannabinoid from fiber hemp (Cannabis sativa). J Nat Prod74:2019-22 (2011) 
 
Cannabinoid receptor 2
Name:Cannabinoid receptor 2
Type:G Protein-Coupled Receptor (GPCR)
Mol. Mass.:39690.94
Organism:Homo sapiens (Human)
Description:P34972
Residue:360
BDBM50353094
NameBDBM50353094
Synonyms:CHEMBL1823117
TypeSmall organic molecule
Emp. Form.C26H40O2
Mol. Mass.384.5946
SMILES[#6]-[#6]-[#6]-[#6]-[#6]-c1cc(-[#8])c(-[#6]\[#6]=[#6](/[#6])-[#6]-[#6]\[#6]=[#6](/[#6])-[#6]-[#6]\[#6]=[#6](\[#6])-[#6])c(-[#8])c1