Reaction Details
TargetTransient receptor potential cation channel subfamily A member 1
LigandBDBM50318487
Substrate/Competitorn/a
Meas. Tech.ChEMBL_768015 (CHEMBL1825344)
IC50 13000±n/a nM
Citation Pollastro, FTaglialatela-Scafati, OAllarà, MMuñoz, EDi Marzo, VDe Petrocellis, LAppendino, G Bioactive prenylogous cannabinoid from fiber hemp (Cannabis sativa). J Nat Prod74:2019-22 (2011) 
 
Transient receptor potential cation channel subfamily A member 1
Name:Transient receptor potential cation channel subfamily A member 1
Type:PROTEIN
Mol. Mass.:128622.74
Organism:Rattus norvegicus
Description:ChEMBL_1450487
Residue:1125
BDBM50318487
NameBDBM50318487
Synonyms:CHEMBL497318 | Cannabigerol
TypeSmall organic molecule
Emp. Form.C21H32O2
Mol. Mass.316.4776
SMILES[#6]-[#6]-[#6]-[#6]-[#6]-c1cc(-[#8])c(-[#6]\[#6]=[#6](/[#6])-[#6]-[#6]\[#6]=[#6](\[#6])-[#6])c(-[#8])c1