Reaction Details
TargetTransient receptor potential cation channel subfamily M member 8
LigandBDBM50318487
Substrate/Competitorn/a
Meas. Tech.ChEMBL_768016 (CHEMBL1825345)
IC50 160±n/a nM
Citation Pollastro, FTaglialatela-Scafati, OAllarà, MMuñoz, EDi Marzo, VDe Petrocellis, LAppendino, G Bioactive prenylogous cannabinoid from fiber hemp (Cannabis sativa). J Nat Prod74:2019-22 (2011) 
 
Transient receptor potential cation channel subfamily M member 8
Name:Transient receptor potential cation channel subfamily M member 8
Type:Enzyme
Mol. Mass.:127633.53
Organism:Rattus norvegicus (Rat)
Description:Q8R455
Residue:1104
BDBM50318487
NameBDBM50318487
Synonyms:CHEMBL497318 | Cannabigerol
TypeSmall organic molecule
Emp. Form.C21H32O2
Mol. Mass.316.4776
SMILES[#6]-[#6]-[#6]-[#6]-[#6]-c1cc(-[#8])c(-[#6]\[#6]=[#6](/[#6])-[#6]-[#6]\[#6]=[#6](\[#6])-[#6])c(-[#8])c1