Reaction Details
TargetInhibitor of nuclear factor kappa-B kinase subunit beta
LigandBDBM50149839
Substrate/Competitorn/a
Meas. Tech.ChEMBL_769089 (CHEMBL1832646)
IC50 4±n/a nM
Citation Sun, HPZhu, JChen, FHZhang, SLZhang, YYou, QD Combination of pharmacophore model development and binding mode analyses: identification of ligand features essential for I¿B kinase-beta (IKKß) inhibitors and virtual screening based on it. Eur J Med Chem46:3942-52 (2011) 
 
Inhibitor of nuclear factor kappa-B kinase subunit beta
Name:Inhibitor of nuclear factor kappa-B kinase subunit beta
Type:Serine/threonine-protein kinase
Mol. Mass.:86554.39
Organism:Homo sapiens (Human)
Description:GST-tagged IKK-2 was expressed in High Five cells and purified.
Residue:756
BDBM50149839
NameBDBM50149839
Synonyms:2''-Amino-6''-(2-cyclobutylmethoxy-6-hydroxy-phenyl)-1,2,3,4,5,6-hexahydro-[3,4'']bipyridinyl-3''-carbonitrile | CHEMBL183703
TypeSmall organic molecule
Emp. Form.C22H26N4O2
Mol. Mass.378.4674
SMILESNc1nc(cc(C2CCCNC2)c1C#N)-c1c(O)cccc1OCC1CCC1