Reaction Details
TargetCytochrome P450 26A1
LigandBDBM50353584
Substrate/Competitorn/a
Meas. Tech.ChEMBL_769532 (CHEMBL1833279)
IC50 140±n/a nM
Citation Gomaa, MSBridgens, CEVeal, GJRedfern, CPBrancale, AArmstrong, JLSimons, C Synthesis and biological evaluation of 3-(1H-imidazol- and triazol-1-yl)-2,2-dimethyl-3-[4-(naphthalen-2-ylamino)phenyl]propyl derivatives as small molecule inhibitors of retinoic acid 4-hydroxylase (CYP26). J Med Chem54:6803-11 (2011) 
 
Cytochrome P450 26A1
Name:Cytochrome P450 26A1
Type:Enzyme
Mol. Mass.:56216.16
Organism:Homo sapiens (Human)
Description:O43174
Residue:497
BDBM50353584
NameBDBM50353584
Synonyms:CHEMBL1831085
TypeSmall organic molecule
Emp. Form.C29H33N3O2
Mol. Mass.455.5912
SMILESCCCCCOC(=O)C(C)(C)C(c1ccc(Nc2ccc3ccccc3c2)cc1)n1ccnc1