Reaction Details
TargetKinesin-like protein KIF11
LigandBDBM50353821
Substrate/Competitorn/a
Meas. Tech.ChEMBL_770426 (CHEMBL1833735)
IC50 10±n/a nM
Citation Theoclitou, MEAquila, BBlock, MHBrassil, PJCastriotta, LCode, ECollins, MPDavies, AMDeegan, TEzhuthachan, JFilla, SFreed, EHu, HHuszar, DJayaraman, MLawson, DLewis, PMNadella, MVOza, VPadmanilayam, MPontz, TRonco, LRussell, DWhitston, DZheng, X Discovery of (+)-N-(3-aminopropyl)-N-[1-(5-benzyl-3-methyl-4-oxo-[1,2]thiazolo[5,4-d]pyrimidin-6-yl)-2-methylpropyl]-4-methylbenzamide (AZD4877), a kinesin spindle protein inhibitor and potential anticancer agent. J Med Chem54:6734-50 (2011) 
 
Kinesin-like protein KIF11
Name:Kinesin-like protein KIF11
Type:PROTEIN
Mol. Mass.:119138.97
Organism:Homo sapiens (Human)
Description:ChEMBL_1457426
Residue:1056
BDBM50353821
NameBDBM50353821
Synonyms:CHEMBL1829246
TypeSmall organic molecule
Emp. Form.C27H30N4O2S
Mol. Mass.474.618
SMILESCCC(N(CCCN)C(=O)c1ccc(C)cc1)c1nc2ccsc2c(=O)n1Cc1ccccc1