Reaction Details
TargetSigma non-opioid intracellular receptor 1
LigandBDBM50353844
Substrate/Competitorn/a
Meas. Tech.ChEMBL_769360 (CHEMBL1833366)
Ki 4.17±n/a nM
Citation Mésangeau, CAmata, EAlsharif, WSeminerio, MJRobson, MJMatsumoto, RRPoupaert, JHMcCurdy, CR Synthesis and pharmacological evaluation of indole-based sigma receptor ligands. Eur J Med Chem46:5154-61 (2011) 
 
Sigma non-opioid intracellular receptor 1
Name:Sigma non-opioid intracellular receptor 1
Type:Enzyme Catalytic Domain
Mol. Mass.:25266.54
Organism:RAT
Description:Q9R0C9
Residue:223
BDBM50353844
NameBDBM50353844
Synonyms:CHEMBL270341 US9724435, Compound CM-145
TypeSmall organic molecule
Emp. Form.C21H31N3OS
Mol. Mass.373.555
SMILESO=c1sc2ccccc2n1CCCCN1CCN(CC1)C1CCCCC1