Reaction Details
TargetSigma non-opioid intracellular receptor 1
LigandBDBM50137618
Substrate/Competitorn/a
Meas. Tech.ChEMBL_769432 (CHEMBL1833529)
Ki 12900±n/a nM
Citation Mésangeau, CAmata, EAlsharif, WSeminerio, MJRobson, MJMatsumoto, RRPoupaert, JHMcCurdy, CR Synthesis and pharmacological evaluation of indole-based sigma receptor ligands. Eur J Med Chem46:5154-61 (2011) 
 
Sigma non-opioid intracellular receptor 1
Name:Sigma non-opioid intracellular receptor 1
Type:Enzyme Catalytic Domain
Mol. Mass.:25124.85
Organism:Homo sapiens (Human)
Description:Q99720
Residue:223
BDBM50137618
NameBDBM50137618
Synonyms:5-Bromo-N-[4-(6,7-dimethoxy-3,4-dihydro-1H-isoquinolin-2-yl)-butyl]-2,3-dimethoxy-benzamide CHEMBL291439
TypeSmall organic molecule
Emp. Form.C24H31BrN2O5
Mol. Mass.507.417
SMILESCOc1cc2CCN(CCCCNC(=O)c3cc(Br)cc(OC)c3OC)Cc2cc1OC