Reaction Details
TargetHistone deacetylase 7
LigandBDBM50354085
Substrate/Competitorn/a
Meas. Tech.ChEMBL_770953 (CHEMBL1838192)
IC50 24000±n/a nM
Citation Wang, CHenkes, LMDoughty, LBHe, MWang, DMeyer-Almes, FJCheng, YQ Thailandepsins: bacterial products with potent histone deacetylase inhibitory activities and broad-spectrum antiproliferative activities. J Nat Prod74:2031-8 (2011) 
 
Histone deacetylase 7
Name:Histone deacetylase 7
Type:Chromatin regulator; hydrolase; repressor
Mol. Mass.:102942.62
Organism:Homo sapiens (Human)
Description:Q8WUI4
Residue:952
BDBM50354085
NameBDBM50354085
Synonyms:CHEMBL1836042
TypeSmall organic molecule
Emp. Form.C24H41N3O6S2
Mol. Mass.531.729
SMILESCCCC[C@H]1NC(=O)C[C@H](OC(=O)C[C@H](O)[C@H](NC(=O)[C@@H](CS)NC1=O)[C@@H](C)CC)\C=C\CCS