Reaction Details
TargetHistone deacetylase 8
LigandBDBM50354089
Substrate/Competitorn/a
Meas. Tech.ChEMBL_770954 (CHEMBL1838193)
IC50 1200±n/a nM
Citation Wang, CHenkes, LMDoughty, LBHe, MWang, DMeyer-Almes, FJCheng, YQ Thailandepsins: bacterial products with potent histone deacetylase inhibitory activities and broad-spectrum antiproliferative activities. J Nat Prod74:2031-8 (2011) 
 
Histone deacetylase 8
Name:Histone deacetylase 8
Type:Enzyme
Mol. Mass.:41749.60
Organism:Homo sapiens (Human)
Description:Q9BY41
Residue:377
BDBM50354089
NameBDBM50354089
Synonyms:CHEMBL1836144
TypeSmall organic molecule
Emp. Form.C23H39N3O6S3
Mol. Mass.549.767
SMILESCC[C@H](C)[C@H]1NC(=O)[C@@H](CS)NC(=O)[C@@H](CCSC)NC(=O)C[C@H](OC(=O)C[C@@H]1O)\C=C\CCS