Reaction Details
TargetHistone deacetylase 9
LigandBDBM50354087
Substrate/Competitorn/a
Meas. Tech.ChEMBL_770955 (CHEMBL1838194)
IC50 12000±n/a nM
Citation Wang, CHenkes, LMDoughty, LBHe, MWang, DMeyer-Almes, FJCheng, YQ Thailandepsins: bacterial products with potent histone deacetylase inhibitory activities and broad-spectrum antiproliferative activities. J Nat Prod74:2031-8 (2011) 
 
Histone deacetylase 9
Name:Histone deacetylase 9
Type:Enzyme
Mol. Mass.:111304.31
Organism:Homo sapiens (Human)
Description:Q9UKV0
Residue:1011
BDBM50354087
NameBDBM50354087
Synonyms:CHEMBL1836143
TypeSmall organic molecule
Emp. Form.C24H38N4O6S2
Mol. Mass.542.712
SMILESC\C=C1\NC(=O)[C@@H](CS)NC(=O)[C@H](NC(=O)C[C@H](OC(=O)[C@@H](NC1=O)C(C)C)\C=C\CCS)C(C)C