Reaction Details
TargetHistone deacetylase 9
LigandBDBM50354088
Substrate/Competitorn/a
Meas. Tech.ChEMBL_770955 (CHEMBL1838194)
IC50>50000±n/a nM
Citation Wang, CHenkes, LMDoughty, LBHe, MWang, DMeyer-Almes, FJCheng, YQ Thailandepsins: bacterial products with potent histone deacetylase inhibitory activities and broad-spectrum antiproliferative activities. J Nat Prod74:2031-8 (2011) 
 
Histone deacetylase 9
Name:Histone deacetylase 9
Type:Enzyme
Mol. Mass.:111304.31
Organism:Homo sapiens (Human)
Description:Q9UKV0
Residue:1011
BDBM50354088
NameBDBM50354088
Synonyms:CHEMBL1836142
TypeSmall organic molecule
Emp. Form.C23H37N3O6S3
Mol. Mass.547.751
SMILESCC[C@H](C)[C@H]1NC(=O)[C@H]2CSSCC\C=C\[C@H](CC(=O)N[C@H](CCSC)C(=O)N2)OC(=O)C[C@@H]1O