Reaction Details
TargetHistone deacetylase 4
LigandBDBM50354085
Substrate/Competitorn/a
Meas. Tech.ChEMBL_770951 (CHEMBL1838190)
IC50 18000±n/a nM
Citation Wang, CHenkes, LMDoughty, LBHe, MWang, DMeyer-Almes, FJCheng, YQ Thailandepsins: bacterial products with potent histone deacetylase inhibitory activities and broad-spectrum antiproliferative activities. J Nat Prod74:2031-8 (2011) 
 
Histone deacetylase 4
Name:Histone deacetylase 4
Type:Enzyme
Mol. Mass.:119049.39
Organism:Homo sapiens (Human)
Description:P56524
Residue:1084
BDBM50354085
NameBDBM50354085
Synonyms:CHEMBL1836042
TypeSmall organic molecule
Emp. Form.C24H41N3O6S2
Mol. Mass.531.729
SMILESCCCC[C@H]1NC(=O)C[C@H](OC(=O)C[C@H](O)[C@H](NC(=O)[C@@H](CS)NC1=O)[C@@H](C)CC)\C=C\CCS