Reaction Details
TargetHistone deacetylase 6
LigandBDBM50354087
Substrate/Competitorn/a
Meas. Tech.ChEMBL_770952 (CHEMBL1838191)
IC50 330±n/a nM
Citation Wang, CHenkes, LMDoughty, LBHe, MWang, DMeyer-Almes, FJCheng, YQ Thailandepsins: bacterial products with potent histone deacetylase inhibitory activities and broad-spectrum antiproliferative activities. J Nat Prod74:2031-8 (2011) 
 
Histone deacetylase 6
Name:Histone deacetylase 6
Type:Chromatin regulator; hydrolase; repressor
Mol. Mass.:131381.51
Organism:Homo sapiens (Human)
Description:Q9UBN7
Residue:1215
BDBM50354087
NameBDBM50354087
Synonyms:CHEMBL1836143
TypeSmall organic molecule
Emp. Form.C24H38N4O6S2
Mol. Mass.542.712
SMILESC\C=C1\NC(=O)[C@@H](CS)NC(=O)[C@H](NC(=O)C[C@H](OC(=O)[C@@H](NC1=O)C(C)C)\C=C\CCS)C(C)C